{"text_format":"5","workbook":"xlsx","n_sheets":3,"sheets":["2020년 평가","안전인증검사자율안전검사기관 평가일정 확인","Sheet1"],"props":{"creator":"jkpark","last_modified_by":"KOSHA","company":"KOSHA"},"not_rendered":{"defined_names":4},"read":"whole","date_system":"1900"}

{"sheet":"2020년 평가","index":0,"n_rows":31,"n_cols":8,"rows_kept":31,"hidden":true}
["순번","사업장관리번호","기관명","주소","2020년 평가일","평가 분야","평가 담당자","담당자 연락처"]
[15,13082070090,"(사)대한산업안전협회","서울시 구로구 공원로 70","2020-07-21","안전검사","김홍식","032-5100-686"]
[17,13082070090,"(사)대한산업안전협회","서울시 구로구 공원로 70","2020-07-22","안전인증","김홍식","032-5100-686"]
[19,40582039316,"한국승강기안전공단","경남 진주시 소호로 102","2020-07-23","안전인증","김홍식","032-5100-686"]
[21,40582039316,"한국승강기안전공단","경남 진주시 소호로 102","2020-07-24","안전검사","김홍식","032-5100-686"]
[24,13382020180,"한국가스안전공사","충남 음성군 맹동면 원중로 1390","2020-07-31","안전인증(방폭)","김홍식","032-5100-686"]
[28,90901902727,"한국산업기술시험원","경남 진주시 충의로 10(서울)","2020-08-03","안전인증(방폭)","김홍식","032-5100-686"]
[null,14082019810,"(사)한국안전기술협회","경기도 안산시 단원구 동산로 76","2020-08-04","안전검사","고영희","032-5100-626"]
[36,13481596710,"한국산업안전관리원(주)","경기도 안산시 단원구 중앙대로 855 (고잔동, 한양빌딩402호,403호)","2020-07-10","자율안전검사","고영희","032-5100-626"]
[null,61081759470,"(주)반도기술검사","울산 울주군 청량읍 삼정로 773-9 (청량면) (528-12번지)","2020-07-15","자율안전검사","김홍식","032-5100-686"]
[40,50681609750,"(주)지스텍","경북 포항시 남구 대송면 장동홍계길 205 (434번지)","2020-07-16","자율안전검사","고영희","032-5100-626"]
[42,61081412430,"(주)한국산업안전검사","울산 남구 두왕로78번길 5-19 (선암동) (5-19 (선암동))","2020-07-16","자율안전검사","김홍식","032-5100-686"]
[49,91506710081,"한국방재안전보건환경기술원(주)","경기도 수원시 권선구 금곡로197번길 18-37 ","2020-07-17","자율안전검사","민지예","032-5100-688"]
[51,60981757050,"(주)한국산업안전검사","창원시 의창구 차상로 72번길 2(경남 창원시 도계동 896-3 1층)","2020-07-17","자율안전검사","김홍식","032-5100-686"]
[53,50681142430,"(주)한국산업안전","경북 포항시 남구 연일읍 동문로 17 (641-1번지)","2020-07-17","자율안전검사","고영희","032-5100-626"]
[57,50381853600,"한국산업안전검사(주）","경북 고령군 다산면 장척1길 23-3 (92번지)","2020-07-21","자율안전검사","고영희","032-5100-626"]
[59,21485319100,"신우개발(서울지점)(주)","서울 서초구 바우뫼로 198 (양재동) (82-7번지)","2020-07-21","자율안전검사","민지예","032-5100-688"]
[67,61581704190,"명신산업안전검사(주)","경남 김해시 번화1로 44번길 32 대명프라자 403호(경상남도 김해시 진례면 고모로324번길 13-공장주소)","2020-07-22","자율안전검사","고영희","032-5100-626"]
[72,77186005190,"주식회사에스솔루션","경기도 하남시 하남대로 947, 하남테크노밸리 유원센터 A동 1505호","2020-07-22","자율안전검사","민지예","032-5100-688"]
[75,24181010640,"주식회사에스텍기술","서울특별시 강서구 공항대로 213 (마곡동, 보타닉파크타워2) 10층 1008호 (54-10번지 영창빌딩 204호)","2020-07-23","자율안전검사","민지예","032-5100-688"]
[76,13981415550,"(주)케이아이기술","인천 미추홀구 인하로 195 502호 (주안동) (749-3번지 성민빌딩 502호)","2020-07-24","자율안전검사","고영희","032-5100-626"]
[79,51587014810,"주식회사 프로메카","경기 수원시 팔달구 덕영대로697번길 21-7(화서동,정자프라자) 3층 301호","2020-07-24","자율안전검사","민지예","032-5100-688"]
[null,61081457970,"(주)코리아안전검사","울산 남구 삼호로37번길 8-1 (무거동) (1428-2)","2020-07-28","자율안전검사","김홍식","032-5100-686"]
[82,30581762860,"한국티에스아이","충청남도 서산시 성연면 솔예로 45 (성연면) (163-4번지)","2020-07-28","자율안전검사","민지예","032-5100-688"]
[null,31181495610,"유양에스엔지주식회사","충청남도 당진시 송악읍 북부산업로 1480 (송악읍, 현대제철(주) 당진제철소내 비열연재질실험실) 3층","2020-07-29","자율안전검사","민지예","032-5100-688"]
[89,91900497757,"한국산업안전검사(주)","경기 수원시 장안구 장안로458번길 75 (이목동) (61-4번지)","2020-07-30","자율안전검사","민지예","032-5100-688"]
[93,41681167630,"천문산업안전(주)","전남 광양시 중마중앙로 125 (중동) (125 (중동))","2020-08-04","자율안전검사","김홍식","032-5100-686"]
[97,90700140951,"유양기술(주)","전남 광양시 옥곡면 신금산단1길 29 (29 (㈜유양기술))","2020-08-05","자율안전검사","김홍식","032-5100-686"]
[110,50681803500,"주식회사우신산업","경북 포항시 북구 흥해읍 해안로 1133 번지","2020-08-06","자율안전검사","고영희","032-5100-626"]
[112,31481736620,"(주)코리아종합안전","대전광역시 유성구 갑천로 361-33 ","2020-08-06","자율안전검사","김홍식","032-5100-686"]
[90,84087013010,"주식회사건설기계평가원","대전 동구 대전로 758, 35-3(뜰안채주상복합 303호","2020-08-07","자율안전검사","김홍식","032-5100-686"]

{"sheet":"안전인증검사자율안전검사기관 평가일정 확인","index":1,"n_rows":9,"n_cols":7,"rows_kept":9,"merged":[[0,1,0,6]]}
[null,"안전인증/검사/자율안전검사기관 평가 일정 확인"]
[]
[null,"사업장관리번호"]
[]
[]
[null,"기관명","주소","2020년 평가일","평가 분야","평가 담당자","담당자 연락처"]
[null,{"$f":"VLOOKUP($B$4,'2020년 평가'!$B$1:$H$31,2,0)","v":{"$error":"#N/A"}},{"$f":"VLOOKUP($B$4,'2020년 평가'!$B$1:$H$31,3,0)","v":{"$error":"#N/A"}},{"$f":"VLOOKUP($B$4,'2020년 평가'!$B$1:$H$31,4,0)","v":{"$error":"#N/A"}},{"$f":"VLOOKUP($B$4,'2020년 평가'!$B$1:$H$31,5,0)","v":{"$error":"#N/A"}},{"$f":"VLOOKUP($B$4,'2020년 평가'!$B$1:$H$31,6,0)","v":{"$error":"#N/A"}},{"$f":"VLOOKUP($B$4,'2020년 평가'!$B$1:$H$31,7,0)","v":{"$error":"#N/A"}}]
[]
[null,"*사업장관리번호(숫자만)를 입력하시면 평가일정을 확인하실 수 있습니다. "]

{"sheet":"Sheet1","index":2,"n_rows":120,"n_cols":6,"rows_kept":120,"hidden":true}
[]
[null,null,"평가반장","평가반원1","평가반원2","2019 평가일"]
[null,null,"류만형","윤태영","이창진","2019-03-19"]
[null,null,"류만형","윤태영","이창진","2019-03-20"]
[null,null,"류만형","윤태영","이창진","2019-03-21"]
[null,null,"윤태영","이정훈",null,"2019-03-25"]
[null,null,"이창진","조경재",null,"2019-03-25"]
[null,null,"윤태영","조경재",null,"2019-03-26"]
[null,null,"류만형","이창진",null,"2019-03-26"]
[null,null,"윤태영","조경재",null,"2019-03-27"]
[null,null,"류만형","이창진",null,"2019-03-27"]
[null,null,"윤태영","이정훈",null,"2019-03-28"]
[null,null,"류만형","이창진","조경재","2019-03-28"]
[null,null,"윤태영","이정훈",null,"2019-03-29"]
[null,null,"이창진","조경재",null,"2019-03-29"]
[null,null,"류만형","이창진",null,"2019-04-01"]
[null,null,"윤태영","이정훈",null,"2019-04-01"]
[null,null,"윤태영","이정훈",null,"2019-04-02"]
[null,null,"류만형","조경재",null,"2019-04-02"]
[null,null,"류만형","조경재",null,"2019-04-03"]
[null,null,"윤태영","이정훈",null,"2019-04-03"]
[null,null,"류만형","윤태영","이정훈","2019-04-04"]
[null,null,"류만형","이창진",null,"2019-04-05"]
[null,null,"윤태영","이정훈",null,"2019-04-05"]
[null,null,"윤태영","이정훈",null,"2019-04-08"]
[null,null,"류만형","조경재",null,"2019-04-08"]
[null,null,"류만형","조경재",null,"2019-04-09"]
[null,null,"윤태영","이정훈",null,"2019-04-09"]
[null,null,"윤태영","이정훈",null,"2019-04-10"]
[null,null,"윤태영","이정훈",null,"2019-04-11"]
[null,null,"류만형","조경재",null,"2019-04-11"]
[null,null,"윤태영","이정훈",null,"2019-04-12"]
[null,null,"류만형","이창진",null,"2019-04-16"]
[null,null,"윤태영","이정훈",null,"2019-04-16"]
[null,null,"윤태영","이정훈","변기동","2019-04-17"]
[null,null,"류만형","이창진",null,"2019-04-17"]
[null,null,"류만형","이창진",null,"2019-04-18"]
[null,null,"윤태영","이정훈",null,"2019-04-18"]
[null,null,"배기두","윤태영","이정훈","2019-04-22"]
[null,null,"이창진","조경재",null,"2019-04-22"]
[null,null,"윤태영","이정훈",null,"2019-04-23"]
[null,null,"류만형","이창진",null,"2019-04-23"]
[null,null,"류만형","조경재",null,"2019-04-24"]
[null,null,"윤태영","이정훈",null,"2019-04-24"]
[null,null,"류만형","이창진",null,"2019-04-25"]
[null,null,"윤태영","이정훈",null,"2019-04-25"]
[null,null,"이창진","조경재",null,"2019-04-26"]
[null,null,"윤태영","이정훈",null,"2019-04-26"]
[null,null,"류만형","조경재",null,"2019-05-07"]
[null,null,"류만형","이창진",null,"2019-05-13"]
[null,null,"류만형","이창진",null,"2019-05-17"]
{"$rows_empty":8}
[null,null,"윤태영","이정훈",null,"2019-05-02"]
[]
[null,null,"배기두","윤태영","이정훈","2019-05-03"]
[null,null,"윤태영","이정훈",null,"2019-05-27"]
[null,null,"류만형","조경재",null,"2019-05-02"]
[null,null,"윤태영","이정훈","(오전)","2019-05-28"]
[]
[null,null,"이창진","조경재",null,"2019-05-03"]
[]
[]
[null,null,"류만형","조경재",null,"2019-05-14"]
[null,null,"류만형","이창진",null,"2019-05-09"]
[]
[]
[]
[null,null,"류만형","이창진",null,"2019-05-16"]
[null,null,"류만형","이창진",null,"2019-05-15"]
[null,null,"윤태영","이정훈",null,"2019-04-30"]
[null,null,"윤태영","이정훈",null,"2019-05-23"]
[null,null,"류만형","이창진",null,"2019-05-23"]
[]
[]
[null,null,"윤태영","이정훈",null,"2019-05-30"]
[]
[]
[null,null,"윤태영","이정훈",null,"2019-05-21"]
[]
[]
[]
[null,null,"류만형","이창진",null,"2019-05-22"]
[]
[]
[]
[null,null,"류만형","이창진",null,"2019-05-24"]
[null,null,"윤태영","이정훈",null,"2019-05-22"]
[null,null,"윤태영","이정훈",null,"2019-05-24"]
[null,null,"윤태영","이정훈",null,"2019-05-09"]
[]
[]
[]
[]
[null,null,"윤태영","이정훈",null,"2019-05-29"]
[]
[]
[null,null,"윤태영","이정훈",null,"2019-05-08"]
[]
[null,null,"류만형","이창진",null,"2019-05-21"]
[null,null,"윤태영","이정훈",null,"2019-05-14"]
[]
[]
[]
[]
[null,null,"윤태영","이정훈",null,"2019-05-15"]
[null,null,"윤태영","이정훈",null,"2019-05-13"]
[]
[]
[null,null,"류만형","이창진",null,"2019-05-28"]
[]
[null,null,"류만형","이창진",null,"2019-05-29"]
[]
[null,null,"류만형","이창진",null,"2019-05-30"]